{"text_format":"1","workbook":"xlsx","n_sheets":4,"sheets":["Values","Worksheet","Answers","Working"],"not_rendered":{"charts":0,"images":0,"macros":1,"external_links":0,"defined_names":0,"comments":0,"pivot_tables":0},"unopened":[],"bounds":{"document_bytes":16777216,"sheet_cells":100000,"rows_first":2000,"rows_last":500,"rows_between":2000,"halvings":0,"cell_chars":16384,"cell_head_chars":4096},"cells_cut":0,"cells_raw":0,"read":"whole","date_system":"1900"}

{"sheet":"Values","index":0,"n_rows":20,"n_cols":9,"rows_kept":20,"cut":false,"hidden":false,"merged":[[7,2,7,6],[7,8,11,9],[9,2,12,7],[0,2,0,6],[2,2,3,7],[5,2,5,4],[6,2,6,7]]}
[null,null,"INSTRUCTIONS"]
[]
[null,"Step 1","Enter the largest denominator to be used for this sheet. (A whole number >2 and <30 )"]
[]
[]
[null,null,"The Number"]
[]
[null,"Step 2","Click on WorkSheet tab below.",null,null,null,null,null,"PRESS F9 for NEW WorkSheet"]
[]
[null,"Note","If you click on the WorkSheet tab then hold down shift and click on the Solutions tab, you will be able to print both the WorkSheet and the solutions."]
[]
[]
[]
[]
[]
[null,null,"NOTES"]
[null,null,"* Practise adding proper fractions."]
[null,null,"* All answers are proper fractions."]
[null,null,"* The answers also include the simplified answer (HCF is divided)."]
[null,null,"* This WorkSheet will generate 20 questions at random."]

{"sheet":"Worksheet","index":1,"n_rows":34,"n_cols":21,"rows_kept":34,"cut":false,"hidden":false,"merged":[[14,1,15,1],[14,2,14,3],[15,2,15,3],[17,0,18,0],[19,1,20,1],[19,2,19,3],[21,6,22,6],[19,6,20,6],[17,8,18,8],[19,7,19,8],[3,0,4,0],[3,3,4,3],[5,6,6,6],[3,5,4,5],[7,6,8,6],[3,8,4,8],[3,10,4,10],[10,0,11,0],[10,3,11,3],[10,5,11,5],[10,8,11,8],[3,11,4,11],[3,14,4,14],[3,16,4,16],[3,19,4,19],[5,1,6,1],[5,2,5,3],[5,7,5,8],[5,12,6,12],[5,13,5,14],[5,17,6,17],[5,18,5,19],[6,2,6,3],[6,7,6,8],[6,13,6,14],[6,18,6,19],[7,1,8,1],[7,2,7,3],[7,7,7,8],[7,12,8,12],[7,13,7,14],[12,1,13,1],[12,2,12,3],[12,6,13,6],[12,7,12,8],[12,12,13,12],[7,17,8,17],[7,18,7,19],[8,2,8,3],[8,7,8,8],[8,13,8,14],[8,18,8,19],[12,13,12,14],[12,17,13,17],[12,18,12,19],[13,2,13,3],[13,7,13,8],[13,13,13,14],[13,18,13,19],[10,10,11,10],[10,11,11,11],[10,14,11,14],[10,16,11,16],[10,19,11,19],[14,6,15,6],[14,7,14,8],[14,12,15,12],[14,13,14,14],[14,17,15,17],[14,18,14,19],[15,7,15,8],[15,13,15,14],[15,18,15,19],[19,12,20,12],[19,13,19,14],[19,17,20,17],[19,18,19,19],[20,2,20,3],[20,7,20,8],[20,13,20,14],[20,18,20,19],[17,3,18,3],[17,5,18,5],[17,11,18,11],[17,14,18,14],[17,16,18,16],[17,19,18,19],[17,10,18,10],[24,0,25,0],[24,3,25,3],[24,5,25,5],[24,8,25,8],[24,10,25,10],[21,1,22,1],[21,2,21,3],[21,7,21,8],[21,12,22,12],[26,1,27,1],[26,2,26,3],[26,6,27,6],[26,7,26,8],[26,12,27,12],[26,13,26,14],[21,18,21,19],[22,2,22,3],[22,7,22,8],[22,13,22,14],[22,18,22,19],[21,13,21,14],[21,17,22,17],[26,17,27,17],[26,18,26,19],[27,2,27,3],[27,7,27,8],[27,13,27,14],[27,18,27,19],[24,11,25,11],[24,14,25,14],[24,16,25,16],[24,19,25,19],[31,0,32,0],[31,3,32,3],[31,5,32,5],[31,8,32,8],[31,10,32,10],[31,11,32,11],[28,17,29,17],[28,18,28,19],[29,2,29,3],[29,7,29,8],[29,13,29,14],[29,18,29,19],[28,1,29,1],[28,2,28,3],[28,6,29,6],[28,7,28,8],[28,12,29,12],[28,13,28,14],[35,1,36,1],[35,2,35,3],[35,6,36,6],[35,7,35,8],[35,12,36,12],[31,14,32,14],[31,16,32,16],[31,19,32,19],[33,1,34,1],[33,2,33,3],[33,6,34,6],[33,7,33,8],[33,12,34,12],[33,13,33,14],[33,17,34,17],[35,13,35,14],[35,17,36,17],[35,18,35,19],[36,2,36,3],[36,7,36,8],[36,13,36,14],[36,18,36,19],[33,18,33,19],[34,2,34,3],[34,7,34,8],[34,13,34,14],[34,18,34,19]]}
[null,null,null,null,null,null,null,null,null,null,"ADDITION OF FRACTIONS"]
[null,null,null,null,null,null,null,null,null,null,null,null,null,null,null,null,null,null,null,null,{"$f":"CONCATENATE(\"Worksheet \",Working!D1,Working!B1)","v":"Worksheet FR - 884"}]
["Simplify the following;"]
["1)",null,{"$f":"Working!W5","v":0},{"$f":"Working!X5","v":"+"},{"$f":"Working!Y5","v":1},"6)",null,{"$f":"Working!W15","v":0},{"$f":"Working!X5","v":"+"},{"$f":"Working!Y15","v":1},"=","11)",null,{"$f":"Working!W25","v":0},{"$f":"Working!X5","v":"+"},{"$f":"Working!Y25","v":1},"16)",null,{"$f":"Working!W35","v":0},{"$f":"Working!X5","v":"+"},{"$f":"Working!Y35","v":1}]
[null,null,{"$f":"Working!W6","v":1},null,{"$f":"Working!Y6","v":2},null,null,{"$f":"Working!W16","v":1},null,{"$f":"Working!Y16","v":2},null,null,null,{"$f":"Working!W26","v":1},null,{"$f":"Working!Y26","v":2},null,null,{"$f":"Working!W36","v":1},null,{"$f":"Working!Y36","v":2}]
[null,"=",null,null,null,null,"=",null,null,null,null,null,"=",null,null,null,null,"="]
[]
[]
[]
[]
["2)",null,{"$f":"Working!W7","v":0},{"$f":"Working!X7","v":"+"},{"$f":"Working!Y7","v":1},"7)",null,{"$f":"Working!W17","v":0},{"$f":"Working!X7","v":"+"},{"$f":"Working!Y17","v":1},"=","12)",null,{"$f":"Working!W27","v":0},{"$f":"Working!X7","v":"+"},{"$f":"Working!Y27","v":1},"17)",null,{"$f":"Working!W37","v":0},{"$f":"Working!X11","v":"+"},{"$f":"Working!Y37","v":1}]
[null,null,{"$f":"Working!W8","v":1},null,{"$f":"Working!Y8","v":2},null,null,{"$f":"Working!W18","v":1},null,{"$f":"Working!Y18","v":2},null,null,null,{"$f":"Working!W28","v":1},null,{"$f":"Working!Y28","v":2},null,null,{"$f":"Working!W38","v":1},null,{"$f":"Working!Y38","v":2}]
[null,"=",null,null,null,null,"=",null,null,null,null,null,"=",null,null,null,null,"="]
[]
[]
[]
[]
["3)",null,{"$f":"Working!W9","v":0},{"$f":"Working!X9","v":"+"},{"$f":"Working!Y9","v":1},"8)",null,{"$f":"Working!W19","v":0},{"$f":"Working!X9","v":"+"},{"$f":"Working!Y19","v":1},"=","13)",null,{"$f":"Working!W29","v":0},{"$f":"Working!X9","v":"+"},{"$f":"Working!Y29","v":1},"18)",null,{"$f":"Working!W39","v":0},{"$f":"Working!X17","v":"+"},{"$f":"Working!Y39","v":1}]
[null,null,{"$f":"Working!W10","v":1},null,{"$f":"Working!Y10","v":2},null,null,{"$f":"Working!W20","v":1},null,{"$f":"Working!Y20","v":2},null,null,null,{"$f":"Working!W30","v":1},null,{"$f":"Working!Y30","v":2},null,null,{"$f":"Working!W40","v":1},null,{"$f":"Working!Y40","v":2}]
[null,"=",null,null,null,null,"=",null,null,null,null,null,"=",null,null,null,null,"="]
[]
[]
[]
[]
["4)",null,{"$f":"Working!W11","v":0},{"$f":"Working!X11","v":"+"},{"$f":"Working!Y11","v":1},"9)",null,{"$f":"Working!W21","v":0},{"$f":"Working!X11","v":"+"},{"$f":"Working!Y21","v":1},"=","14)",null,{"$f":"Working!W31","v":0},{"$f":"Working!X11","v":"+"},{"$f":"Working!Y31","v":1},"19)",null,{"$f":"Working!W41","v":0},{"$f":"Working!X23","v":"+"},{"$f":"Working!Y41","v":1}]
[null,null,{"$f":"Working!W12","v":1},null,{"$f":"Working!Y12","v":2},null,null,{"$f":"Working!W22","v":1},null,{"$f":"Working!Y22","v":2},null,null,null,{"$f":"Working!W32","v":1},null,{"$f":"Working!Y32","v":2},null,null,{"$f":"Working!W42","v":1},null,{"$f":"Working!Y42","v":2}]
[null,"=",null,null,null,null,"=",null,null,null,null,null,"=",null,null,null,null,"="]
[]
[]
[]
[]
["5)",null,{"$f":"Working!W13","v":0},{"$f":"Working!X13","v":"+"},{"$f":"Working!Y13","v":1},"10)",null,{"$f":"Working!W23","v":0},{"$f":"Working!X13","v":"+"},{"$f":"Working!Y23","v":1},"=","15)",null,{"$f":"Working!W33","v":0},{"$f":"Working!X13","v":"+"},{"$f":"Working!Y33","v":1},"20)",null,{"$f":"Working!W43","v":0},{"$f":"Working!X29","v":"+"},{"$f":"Working!Y43","v":1}]
[null,null,{"$f":"Working!W14","v":1},null,{"$f":"Working!Y14","v":2},null,null,{"$f":"Working!W24","v":1},null,{"$f":"Working!Y24","v":2},null,null,null,{"$f":"Working!W34","v":1},null,{"$f":"Working!Y34","v":2},null,null,{"$f":"Working!W44","v":1},null,{"$f":"Working!Y44","v":2}]
[null,"=",null,null,null,null,"=",null,null,null,null,null,"=",null,null,null,null,"="]

{"sheet":"Answers","index":2,"n_rows":37,"n_cols":21,"rows_kept":37,"cut":false,"hidden":false,"merged":[[24,14,25,14],[31,8,32,8],[31,10,32,10],[31,14,32,14],[31,3,32,3],[3,14,4,14],[3,3,4,3],[10,3,11,3],[10,8,11,8],[10,10,11,10],[10,14,11,14],[17,8,18,8],[17,10,18,10],[17,14,18,14],[17,3,18,3],[3,11,4,11],[17,11,18,11],[24,11,25,11],[31,11,32,11],[3,0,4,0],[10,0,11,0],[17,0,18,0],[3,10,4,10],[3,8,4,8],[24,3,25,3],[24,8,25,8],[24,10,25,10],[26,2,26,3],[27,2,27,3],[5,2,5,3],[6,2,6,3],[5,1,6,1],[7,2,7,3],[8,2,8,3],[7,1,8,1],[12,1,13,1],[35,1,36,1],[35,2,35,3],[36,2,36,3],[5,6,6,6],[5,7,5,8],[6,7,6,8],[7,6,8,6],[7,7,7,8],[8,7,8,8],[12,6,13,6],[28,1,29,1],[28,2,28,3],[29,2,29,3],[33,1,34,1],[33,2,33,3],[34,2,34,3],[19,1,20,1],[19,2,19,3],[20,2,20,3],[21,1,22,1],[21,2,21,3],[22,2,22,3],[26,1,27,1],[12,2,12,3],[35,6,36,6],[35,7,35,8],[36,7,36,8],[5,12,6,12],[5,13,5,14],[6,13,6,14],[7,12,8,12],[7,13,7,14],[8,13,8,14],[12,12,13,12],[28,6,29,6],[28,7,28,8],[29,7,29,8],[33,6,34,6],[33,7,33,8],[34,7,34,8],[21,6,22,6],[21,7,21,8],[22,7,22,8],[26,6,27,6],[26,7,26,8],[27,7,27,8],[12,7,12,8],[13,7,13,8],[35,12,36,12],[35,13,35,14],[36,13,36,14],[3,19,4,19],[5,17,6,17],[5,18,5,19],[6,18,6,19],[7,17,8,17],[28,12,29,12],[28,13,28,14],[29,13,29,14],[33,12,34,12],[33,13,33,14],[34,13,34,14],[21,12,22,12],[21,13,21,14],[22,13,22,14],[26,12,27,12],[26,13,26,14],[27,13,27,14],[12,13,12,14],[13,13,13,14],[14,12,15,12],[14,13,14,14],[12,17,13,17],[12,18,12,19],[13,18,13,19],[14,17,15,17],[14,18,14,19],[15,18,15,19],[7,18,7,19],[8,18,8,19],[10,19,11,19],[21,17,22,17],[21,18,21,19],[22,18,22,19],[24,16,25,16],[24,19,25,19],[17,16,18,16],[17,19,18,19],[19,17,20,17],[19,18,19,19],[20,18,20,19],[35,17,36,17],[35,18,35,19],[36,18,36,19],[31,16,32,16],[31,19,32,19],[33,17,34,17],[33,18,33,19],[34,18,34,19],[26,17,27,17],[26,18,26,19],[27,18,27,19],[28,17,29,17],[28,18,28,19],[29,18,29,19],[10,11,11,11],[3,16,4,16],[10,16,11,16],[24,0,25,0],[31,0,32,0],[3,5,4,5],[10,5,11,5],[17,5,18,5],[31,5,32,5],[24,5,25,5],[15,13,15,14],[19,12,20,12],[19,13,19,14],[20,13,20,14],[14,6,15,6],[14,7,14,8],[15,7,15,8],[19,6,20,6],[19,7,19,8],[20,7,20,8],[13,2,13,3],[14,1,15,1],[14,2,14,3],[15,2,15,3]]}
[null,null,null,null,null,null,null,null,null,null,"ADDITION OF FRACTIONS"]
[null,null,null,null,null,null,null,null,null,null,"ANSWERS",null,null,null,null,null,null,null,null,null,{"$f":"CONCATENATE(\"Worksheet \",Working!D1,Working!B1)","v":"Worksheet FR - 884"}]
[null,"Simplify the following;"]
["1)",null,{"$f":"Working!W5","v":0},{"$f":"Working!X5","v":"+"},{"$f":"Working!Y5","v":1},"6)",null,{"$f":"Working!W15","v":0},{"$f":"Working!X5","v":"+"},{"$f":"Working!Y15","v":1},"=","11)",null,{"$f":"Working!W25","v":0},{"$f":"Working!X5","v":"+"},{"$f":"Working!Y25","v":1},"16)",null,{"$f":"Working!W35","v":0},{"$f":"Working!X5","v":"+"},{"$f":"Working!Y35","v":1}]
[null,null,{"$f":"Working!W6","v":1},null,{"$f":"Working!Y6","v":2},null,null,{"$f":"Working!W16","v":1},null,{"$f":"Working!Y16","v":2},null,null,null,{"$f":"Working!W26","v":1},null,{"$f":"Working!Y26","v":2},null,null,{"$f":"Working!W36","v":1},null,{"$f":"Working!Y36","v":2}]
[null,"=",{"$f":"Working!$AA5","v":1},null,null,null,"=",{"$f":"Working!AA15","v":1},null,null,null,null,"=",{"$f":"Working!$AA25","v":1},null,null,null,"=",{"$f":"Working!$AA35","v":1}]
[null,null,{"$f":"Working!$AA6","v":2},null,null,null,null,{"$f":"Working!AA16","v":2},null,null,null,null,null,{"$f":"Working!$AA26","v":2},null,null,null,null,{"$f":"Working!$AA36","v":2}]
[null,{"$f":"IF(Working!AF5=\"\",\"\",\"=\")","v":""},{"$f":"Working!$AF5","v":""},null,null,null,{"$f":"IF(Working!AF15=\"\",\"\",\"=\")","v":""},{"$f":"Working!AF15","v":""},null,null,null,null,{"$f":"IF(Working!AF25=\"\",\"\",\"=\")","v":""},{"$f":"Working!$AF25","v":""},null,null,null,{"$f":"IF(Working!AF35=\"\",\"\",\"=\")","v":""},{"$f":"Working!$AF35","v":""}]
[null,null,{"$f":"Working!$AF6","v":""},null,null,null,null,{"$f":"Working!AF16","v":""},null,null,null,null,null,{"$f":"Working!$AF26","v":""},null,null,null,null,{"$f":"Working!$AF36","v":""}]
[]
["2)",null,{"$f":"Working!W7","v":0},{"$f":"Working!X7","v":"+"},{"$f":"Working!Y7","v":1},"7)",null,{"$f":"Working!W17","v":0},{"$f":"Working!X7","v":"+"},{"$f":"Working!Y17","v":1},"=","12)",null,{"$f":"Working!W27","v":0},{"$f":"Working!X7","v":"+"},{"$f":"Working!Y27","v":1},"17)",null,{"$f":"Working!W37","v":0},{"$f":"Working!X11","v":"+"},{"$f":"Working!Y37","v":1}]
[null,null,{"$f":"Working!W8","v":1},null,{"$f":"Working!Y8","v":2},null,null,{"$f":"Working!W18","v":1},null,{"$f":"Working!Y18","v":2},null,null,null,{"$f":"Working!W28","v":1},null,{"$f":"Working!Y28","v":2},null,null,{"$f":"Working!W38","v":1},null,{"$f":"Working!Y38","v":2}]
[null,"=",{"$f":"Working!AA7","v":1},null,null,null,"=",{"$f":"Working!$AA17","v":1},null,null,null,null,"=",{"$f":"Working!$AA27","v":1},null,null,null,"=",{"$f":"Working!$AA37","v":1}]
[null,null,{"$f":"Working!AA8","v":2},null,null,null,null,{"$f":"Working!$AA18","v":2},null,null,null,null,null,{"$f":"Working!$AA28","v":2},null,null,null,null,{"$f":"Working!$AA38","v":2}]
[null,{"$f":"IF(Working!AF7=\"\",\"\",\"=\")","v":""},{"$f":"Working!AF7","v":""},null,null,null,{"$f":"IF(Working!AF17=\"\",\"\",\"=\")","v":""},{"$f":"Working!$AF17","v":""},null,null,null,null,{"$f":"IF(Working!AF28=\"\",\"\",\"=\")","v":""},{"$f":"Working!$AF27","v":""},null,null,null,{"$f":"IF(Working!AF37=\"\",\"\",\"=\")","v":""},{"$f":"Working!$AF37","v":""}]
[null,null,{"$f":"Working!AF8","v":""},null,null,null,null,{"$f":"Working!$AF18","v":""},null,null,null,null,null,{"$f":"Working!$AF28","v":""},null,null,null,null,{"$f":"Working!$AF38","v":""}]
[]
["3)",null,{"$f":"Working!W9","v":0},{"$f":"Working!X9","v":"+"},{"$f":"Working!Y9","v":1},"8)",null,{"$f":"Working!W19","v":0},{"$f":"Working!X9","v":"+"},{"$f":"Working!Y19","v":1},"=","13)",null,{"$f":"Working!W29","v":0},{"$f":"Working!X9","v":"+"},{"$f":"Working!Y29","v":1},"18)",null,{"$f":"Working!W39","v":0},{"$f":"Working!X17","v":"+"},{"$f":"Working!Y39","v":1}]
[null,null,{"$f":"Working!W10","v":1},null,{"$f":"Working!Y10","v":2},null,null,{"$f":"Working!W20","v":1},null,{"$f":"Working!Y20","v":2},null,null,null,{"$f":"Working!W30","v":1},null,{"$f":"Working!Y30","v":2},null,null,{"$f":"Working!W40","v":1},null,{"$f":"Working!Y40","v":2}]
[null,"=",{"$f":"Working!AA9","v":1},null,null,null,"=",{"$f":"Working!$AA19","v":1},null,null,null,null,"=",{"$f":"Working!$AA29","v":1},null,null,null,"=",{"$f":"Working!$AA39","v":1}]
[null,null,{"$f":"Working!AA10","v":2},null,null,null,null,{"$f":"Working!$AA20","v":2},null,null,null,null,null,{"$f":"Working!$AA30","v":2},null,null,null,null,{"$f":"Working!$AA40","v":2}]
[null,{"$f":"IF(Working!AF9=\"\",\"\",\"=\")","v":""},{"$f":"Working!AF9","v":""},null,null,null,{"$f":"IF(Working!AF19=\"\",\"\",\"=\")","v":""},{"$f":"Working!$AF19","v":""},null,null,null,null,{"$f":"IF(Working!AF29=\"\",\"\",\"=\")","v":""},{"$f":"Working!$AF29","v":""},null,null,null,{"$f":"IF(Working!AF39=\"\",\"\",\"=\")","v":""},{"$f":"Working!$AF39","v":""}]
[null,null,{"$f":"Working!AF10","v":""},null,null,null,null,{"$f":"Working!$AF20","v":""},null,null,null,null,null,{"$f":"Working!$AF30","v":""},null,null,null,null,{"$f":"Working!$AF40","v":""}]
[]
["4)",null,{"$f":"Working!W11","v":0},{"$f":"Working!X11","v":"+"},{"$f":"Working!Y11","v":1},"9)",null,{"$f":"Working!W21","v":0},{"$f":"Working!X11","v":"+"},{"$f":"Working!Y21","v":1},"=","14)",null,{"$f":"Working!W31","v":0},{"$f":"Working!X11","v":"+"},{"$f":"Working!Y31","v":1},"19)",null,{"$f":"Working!W41","v":0},{"$f":"Working!X23","v":"+"},{"$f":"Working!Y41","v":1}]
[null,null,{"$f":"Working!W12","v":1},null,{"$f":"Working!Y12","v":2},null,null,{"$f":"Working!W22","v":1},null,{"$f":"Working!Y22","v":2},null,null,null,{"$f":"Working!W32","v":1},null,{"$f":"Working!Y32","v":2},null,null,{"$f":"Working!W42","v":1},null,{"$f":"Working!Y42","v":2}]
[null,"=",{"$f":"Working!AA11","v":1},null,null,null,"=",{"$f":"Working!$AA21","v":1},null,null,null,null,"=",{"$f":"Working!$AA31","v":1},null,null,null,"=",{"$f":"Working!$AA41","v":1}]
[null,null,{"$f":"Working!AA12","v":2},null,null,null,null,{"$f":"Working!$AA22","v":2},null,null,null,null,null,{"$f":"Working!$AA32","v":2},null,null,null,null,{"$f":"Working!$AA42","v":2}]
[null,{"$f":"IF(Working!AF11=\"\",\"\",\"=\")","v":""},{"$f":"Working!AF11","v":""},null,null,null,{"$f":"IF(Working!AF21=\"\",\"\",\"=\")","v":""},{"$f":"Working!$AF21","v":""},null,null,null,null,{"$f":"IF(Working!AF31=\"\",\"\",\"=\")","v":""},{"$f":"Working!$AF31","v":""},null,null,null,{"$f":"IF(Working!AF41=\"\",\"\",\"=\")","v":""},{"$f":"Working!$AF41","v":""}]
[null,null,{"$f":"Working!AF12","v":""},null,null,null,null,{"$f":"Working!$AF22","v":""},null,null,null,null,null,{"$f":"Working!$AF32","v":""},null,null,null,null,{"$f":"Working!$AF42","v":""}]
[]
["5)",null,{"$f":"Working!W13","v":0},{"$f":"Working!X13","v":"+"},{"$f":"Working!Y13","v":1},"10)",null,{"$f":"Working!W23","v":0},{"$f":"Working!X13","v":"+"},{"$f":"Working!Y23","v":1},"=","15)",null,{"$f":"Working!W33","v":0},{"$f":"Working!X13","v":"+"},{"$f":"Working!Y33","v":1},"20)",null,{"$f":"Working!W43","v":0},{"$f":"Working!X29","v":"+"},{"$f":"Working!Y43","v":1}]
[null,null,{"$f":"Working!W14","v":1},null,{"$f":"Working!Y14","v":2},null,null,{"$f":"Working!W24","v":1},null,{"$f":"Working!Y24","v":2},null,null,null,{"$f":"Working!W34","v":1},null,{"$f":"Working!Y34","v":2},null,null,{"$f":"Working!W44","v":1},null,{"$f":"Working!Y44","v":2}]
[null,"=",{"$f":"Working!AA13","v":1},null,null,null,"=",{"$f":"Working!$AA23","v":1},null,null,null,null,"=",{"$f":"Working!$AA33","v":1},null,null,null,"=",{"$f":"Working!$AA43","v":1}]
[null,null,{"$f":"Working!AA14","v":2},null,null,null,null,{"$f":"Working!$AA24","v":2},null,null,null,null,null,{"$f":"Working!$AA34","v":2},null,null,null,null,{"$f":"Working!$AA44","v":2}]
[null,{"$f":"IF(Working!AF13=\"\",\"\",\"=\")","v":""},{"$f":"Working!AF13","v":""},null,null,null,{"$f":"IF(Working!AF23=\"\",\"\",\"=\")","v":""},{"$f":"Working!$AF23","v":""},null,null,null,null,{"$f":"IF(Working!AF33=\"\",\"\",\"=\")","v":""},{"$f":"Working!$AF33","v":""},null,null,null,{"$f":"IF(Working!AF43=\"\",\"\",\"=\")","v":""},{"$f":"Working!$AF43","v":""}]
[null,null,{"$f":"Working!AF14","v":""},null,null,null,null,{"$f":"Working!$AF24","v":""},null,null,null,null,null,{"$f":"Working!$AF34","v":""},null,null,null,null,{"$f":"Working!$AF44","v":""}]

{"sheet":"Working","index":3,"n_rows":44,"n_cols":32,"rows_kept":44,"cut":false,"hidden":true,"merged":[]}
[{"$f":"INT(900*RAND()+100)","v":884},{"$f":"TEXT(A1,0)","v":"884"},null,"FR - ",null,null,null,null,null,null,null,null,null,null,null,null,null,null,null,"Max",{"$f":"Values!F6","v":0}]
[null,"First Fraction","Second Fraction",null,"Answer",null,null,"First Fraction",null,null,"For a/b + c/d",null,null,null,null,null,null,null,null,"Second Fraction","Operation",null,"Solution",null,null,null,null,null,null,"HCF"]
[null,"Denominators",null,null,null,null,null,"Numerator"]
[null,"b",null,"d",null,null,null,null,null,null,null,"a",null,null,null,null,null,null,"c"]
[1,{"$f":"INT(($U$1-1)*RAND()+2)","v":1},{"$f":"INT(($U$1-1)*RAND()+3)","v":2},{"$f":"IF(C5=B5,C5+1,C5)","v":2},{"$f":"B5*D5","v":2},{"$f":"E5-C5*D5","v":-2},{"$f":"IF($F5=$B5,$F5-1,$F5)","v":-2},{"$f":"IF(B5=2,1,INT((B5)*0.7*RAND()+1))","v":1},{"$f":"H5*D5","v":2},{"$f":"E5-I5","v":0},{"$f":"J5/B5","v":0},{"$f":"IF(K5<1,H5-1,H5)","v":0},{"$f":"L5*D5","v":0},{"$f":"E5-M5","v":2},{"$f":"N5/B5","v":2},{"$f":"INT($O5)","v":2},{"$f":"INT(P5*RAND()+1)","v":1},{"$f":"Q5*B5","v":1},{"$f":"IF(R5>=N5,Q5-1,Q5)","v":1},{"$f":"S5*B5","v":1},{"$f":"INT(2*RAND())","v":1},"+",{"$f":"L5","v":0},{"$f":"V5","v":"+"},{"$f":"S5","v":1},"=",{"$f":"M5+T5","v":1},{"$f":"IF(AA5>=AA6,\"Bad\",\"Good\")","v":"Good"},null,{"$f":"GCD(AA5,AA6)","v":1},{"$f":"AA5/AD5","v":1},{"$f":"IF(AE5=AA5,\"\",AE5)","v":""}]
[null,null,null,null,null,null,null,null,null,null,null,null,null,null,null,null,null,null,null,null,null,null,{"$f":"B5","v":1},null,{"$f":"D5","v":2},null,{"$f":"E5","v":2},null,null,null,{"$f":"AA6/AD5","v":2},""]
[2,{"$f":"INT(($U$1-1)*RAND()+2)","v":1},{"$f":"INT(($U$1-1)*RAND()+3)","v":2},{"$f":"IF(C7=B7,C7+1,C7)","v":2},{"$f":"B7*D7","v":2},{"$f":"E7-C7*D7","v":-2},{"$f":"IF($F7=$B7,$F7-1,$F7)","v":-2},{"$f":"IF(B7=2,1,INT((B7)*0.7*RAND()+1))","v":1},{"$f":"H7*D7","v":2},{"$f":"E7-I7","v":0},{"$f":"J7/B7","v":0},{"$f":"IF(K7<1,H7-1,H7)","v":0},{"$f":"L7*D7","v":0},{"$f":"E7-M7","v":2},{"$f":"N7/B7","v":2},{"$f":"INT($O7)","v":2},{"$f":"INT(0.99*P7*RAND()+1)","v":2},{"$f":"Q7*B7","v":2},{"$f":"IF(R7>=N7,Q7-1,Q7)","v":1},{"$f":"S7*B7","v":1},{"$f":"INT(2*RAND())","v":1},"+",{"$f":"L7","v":0},{"$f":"V7","v":"+"},{"$f":"S7","v":1},"=",{"$f":"M7+T7","v":1},{"$f":"IF(AA7>=AA8,\"Bad\",\"Good\")","v":"Good"},null,{"$f":"GCD(AA7,AA8)","v":1},{"$f":"AA7/AD7","v":1},""]
[null,null,null,null,null,null,null,null,null,null,null,null,null,null,null,null,null,null,null,null,null,null,{"$f":"B7","v":1},null,{"$f":"D7","v":2},null,{"$f":"E7","v":2},null,null,null,{"$f":"AA8/AD7","v":2},""]
[3,{"$f":"INT(($U$1-1)*RAND()+2)","v":1},{"$f":"INT(($U$1-1)*RAND()+3)","v":2},{"$f":"IF(C9=B9,C9+1,C9)","v":2},{"$f":"B9*D9","v":2},{"$f":"E9-C9*D9","v":-2},{"$f":"IF($F9=$B9,$F9-1,$F9)","v":-2},{"$f":"IF(B9=2,1,INT((B9)*0.7*RAND()+1))","v":1},{"$f":"H9*D9","v":2},{"$f":"E9-I9","v":0},{"$f":"J9/B9","v":0},{"$f":"IF(K9<1,H9-1,H9)","v":0},{"$f":"L9*D9","v":0},{"$f":"E9-M9","v":2},{"$f":"N9/B9","v":2},{"$f":"INT($O9)","v":2},{"$f":"INT(0.99*P9*RAND()+1)","v":2},{"$f":"Q9*B9","v":2},{"$f":"IF(R9>=N9,Q9-1,Q9)","v":1},{"$f":"S9*B9","v":1},{"$f":"INT(2*RAND())","v":0},"+",{"$f":"L9","v":0},{"$f":"V9","v":"+"},{"$f":"S9","v":1},"=",{"$f":"M9+T9","v":1},{"$f":"IF(AA9>=AA10,\"Bad\",\"Good\")","v":"Good"},null,{"$f":"GCD(AA9,AA10)","v":1},{"$f":"AA9/AD9","v":1},""]
[null,null,null,null,null,null,null,null,null,null,null,null,null,null,null,null,null,null,null,null,null,null,{"$f":"B9","v":1},null,{"$f":"D9","v":2},null,{"$f":"E9","v":2},null,null,null,{"$f":"AA10/AD9","v":2},""]
[4,{"$f":"INT(($U$1-1)*RAND()+2)","v":1},{"$f":"INT(($U$1-1)*RAND()+3)","v":2},{"$f":"IF(C11=B11,C11+1,C11)","v":2},{"$f":"B11*D11","v":2},{"$f":"E11-C11*D11","v":-2},{"$f":"IF($F11=$B11,$F11-1,$F11)","v":-2},{"$f":"IF(B11=2,1,INT((B11)*0.7*RAND()+1))","v":1},{"$f":"H11*D11","v":2},{"$f":"E11-I11","v":0},{"$f":"J11/B11","v":0},{"$f":"IF(K11<1,H11-1,H11)","v":0},{"$f":"L11*D11","v":0},{"$f":"E11-M11","v":2},{"$f":"N11/B11","v":2},{"$f":"INT($O11)","v":2},{"$f":"INT(0.99*P11*RAND()+1)","v":2},{"$f":"Q11*B11","v":2},{"$f":"IF(R11>=N11,Q11-1,Q11)","v":1},{"$f":"S11*B11","v":1},0,"+",{"$f":"L11","v":0},{"$f":"V11","v":"+"},{"$f":"S11","v":1},"=",{"$f":"M11+T11","v":1},{"$f":"IF(AA11>=AA12,\"Bad\",\"Good\")","v":"Good"},null,{"$f":"GCD(AA11,AA12)","v":1},{"$f":"AA11/AD11","v":1},""]
[null,null,null,null,null,null,null,null,null,null,null,null,null,null,null,null,null,null,null,null,null,null,{"$f":"B11","v":1},null,{"$f":"D11","v":2},null,{"$f":"E11","v":2},null,null,null,{"$f":"AA12/AD11","v":2},""]
[5,{"$f":"INT(($U$1-1)*RAND()+2)","v":1},{"$f":"INT(($U$1-1)*RAND()+3)","v":2},{"$f":"IF(C13=B13,C13+1,C13)","v":2},{"$f":"B13*D13","v":2},{"$f":"E13-C13*D13","v":-2},{"$f":"IF($F13=$B13,$F13-1,$F13)","v":-2},{"$f":"IF(B13=2,1,INT((B13)*0.7*RAND()+1))","v":1},{"$f":"H13*D13","v":2},{"$f":"E13-I13","v":0},{"$f":"J13/B13","v":0},{"$f":"IF(K13<1,H13-1,H13)","v":0},{"$f":"L13*D13","v":0},{"$f":"E13-M13","v":2},{"$f":"N13/B13","v":2},{"$f":"INT($O13)","v":2},{"$f":"INT(0.99*P13*RAND()+1)","v":1},{"$f":"Q13*B13","v":1},{"$f":"IF(R13>=N13,Q13-1,Q13)","v":1},{"$f":"S13*B13","v":1},1,"+",{"$f":"L13","v":0},{"$f":"V13","v":"+"},{"$f":"S13","v":1},"=",{"$f":"M13+T13","v":1},{"$f":"IF(AA13>=AA14,\"Bad\",\"Good\")","v":"Good"},null,{"$f":"GCD(AA13,AA14)","v":1},{"$f":"AA13/AD13","v":1},""]
[null,null,null,null,null,null,null,null,null,null,null,null,null,null,null,null,null,null,null,null,null,null,{"$f":"B13","v":1},null,{"$f":"D13","v":2},null,{"$f":"E13","v":2},null,null,null,{"$f":"AA14/AD13","v":2},""]
[6,{"$f":"INT(($U$1-1)*RAND()+2)","v":1},{"$f":"INT(($U$1-1)*RAND()+3)","v":2},{"$f":"IF(C15=B15,C15+1,C15)","v":2},{"$f":"B15*D15","v":2},{"$f":"E15-C15*D15","v":-2},{"$f":"IF($F15=$B15,$F15-1,$F15)","v":-2},{"$f":"IF(B15=2,1,INT((B15)*0.7*RAND()+1))","v":1},{"$f":"H15*D15","v":2},{"$f":"E15-I15","v":0},{"$f":"J15/B15","v":0},{"$f":"IF(K15<1,H15-1,H15)","v":0},{"$f":"L15*D15","v":0},{"$f":"E15-M15","v":2},{"$f":"N15/B15","v":2},{"$f":"INT($O15)","v":2},{"$f":"INT(0.99*P15*RAND()+1)","v":2},{"$f":"Q15*B15","v":2},{"$f":"IF(R15>=N15,Q15-1,Q15)","v":1},{"$f":"S15*B15","v":1},0,"+",{"$f":"L15","v":0},{"$f":"V15","v":"+"},{"$f":"S15","v":1},"=",{"$f":"M15+T15","v":1},{"$f":"IF(AA15>=AA16,\"Bad\",\"Good\")","v":"Good"},null,{"$f":"GCD(AA15,AA16)","v":1},{"$f":"AA15/AD15","v":1},""]
[null,null,null,null,null,null,null,null,null,null,null,null,null,null,null,null,null,null,null,null,null,null,{"$f":"B15","v":1},null,{"$f":"D15","v":2},null,{"$f":"E15","v":2},null,null,null,{"$f":"AA16/AD15","v":2},""]
[7,{"$f":"INT(($U$1-1)*RAND()+2)","v":1},{"$f":"INT(($U$1-1)*RAND()+3)","v":2},{"$f":"IF(C17=B17,C17+1,C17)","v":2},{"$f":"B17*D17","v":2},{"$f":"E17-C17*D17","v":-2},{"$f":"IF($F17=$B17,$F17-1,$F17)","v":-2},{"$f":"IF(B17=2,1,INT((B17)*0.7*RAND()+1))","v":1},{"$f":"H17*D17","v":2},{"$f":"E17-I17","v":0},{"$f":"J17/B17","v":0},{"$f":"IF(K17<1,H17-1,H17)","v":0},{"$f":"L17*D17","v":0},{"$f":"E17-M17","v":2},{"$f":"N17/B17","v":2},{"$f":"INT($O17)","v":2},{"$f":"INT(0.99*P17*RAND()+1)","v":1},{"$f":"Q17*B17","v":1},{"$f":"IF(R17>=N17,Q17-1,Q17)","v":1},{"$f":"S17*B17","v":1},0,"+",{"$f":"L17","v":0},{"$f":"V17","v":"+"},{"$f":"S17","v":1},"=",{"$f":"M17+T17","v":1},{"$f":"IF(AA17>=AA18,\"Bad\",\"Good\")","v":"Good"},null,{"$f":"GCD(AA17,AA18)","v":1},{"$f":"AA17/AD17","v":1},""]
[null,null,null,null,null,null,null,null,null,null,null,null,null,null,null,null,null,null,null,null,null,null,{"$f":"B17","v":1},null,{"$f":"D17","v":2},null,{"$f":"E17","v":2},null,null,null,{"$f":"AA18/AD17","v":2},""]
[8,{"$f":"INT(($U$1-1)*RAND()+2)","v":1},{"$f":"INT(($U$1-1)*RAND()+3)","v":2},{"$f":"IF(C19=B19,C19+1,C19)","v":2},{"$f":"B19*D19","v":2},{"$f":"E19-C19*D19","v":-2},{"$f":"IF($F19=$B19,$F19-1,$F19)","v":-2},{"$f":"IF(B19=2,1,INT((B19)*0.7*RAND()+1))","v":1},{"$f":"H19*D19","v":2},{"$f":"E19-I19","v":0},{"$f":"J19/B19","v":0},{"$f":"IF(K19<1,H19-1,H19)","v":0},{"$f":"L19*D19","v":0},{"$f":"E19-M19","v":2},{"$f":"N19/B19","v":2},{"$f":"INT($O19)","v":2},{"$f":"INT(0.99*P19*RAND()+1)","v":2},{"$f":"Q19*B19","v":2},{"$f":"IF(R19>=N19,Q19-1,Q19)","v":1},{"$f":"S19*B19","v":1},0,"+",{"$f":"L19","v":0},{"$f":"V19","v":"+"},{"$f":"S19","v":1},"=",{"$f":"M19+T19","v":1},{"$f":"IF(AA19>=AA20,\"Bad\",\"Good\")","v":"Good"},null,{"$f":"GCD(AA19,AA20)","v":1},{"$f":"AA19/AD19","v":1},""]
[null,null,null,null,null,null,null,null,null,null,null,null,null,null,null,null,null,null,null,null,null,null,{"$f":"B19","v":1},null,{"$f":"D19","v":2},null,{"$f":"E19","v":2},null,null,null,{"$f":"AA20/AD19","v":2},""]
[9,{"$f":"INT(($U$1-1)*RAND()+2)","v":1},{"$f":"INT(($U$1-1)*RAND()+3)","v":2},{"$f":"IF(C21=B21,C21+1,C21)","v":2},{"$f":"B21*D21","v":2},{"$f":"E21-C21*D21","v":-2},{"$f":"IF($F21=$B21,$F21-1,$F21)","v":-2},{"$f":"IF(B21=2,1,INT((B21)*0.7*RAND()+1))","v":1},{"$f":"H21*D21","v":2},{"$f":"E21-I21","v":0},{"$f":"J21/B21","v":0},{"$f":"IF(K21<1,H21-1,H21)","v":0},{"$f":"L21*D21","v":0},{"$f":"E21-M21","v":2},{"$f":"N21/B21","v":2},{"$f":"INT($O21)","v":2},{"$f":"INT(0.99*P21*RAND()+1)","v":2},{"$f":"Q21*B21","v":2},{"$f":"IF(R21>=N21,Q21-1,Q21)","v":1},{"$f":"S21*B21","v":1},0,"+",{"$f":"L21","v":0},{"$f":"V21","v":"+"},{"$f":"S21","v":1},"=",{"$f":"M21+T21","v":1},{"$f":"IF(AA21>=AA22,\"Bad\",\"Good\")","v":"Good"},null,{"$f":"GCD(AA21,AA22)","v":1},{"$f":"AA21/AD21","v":1},""]
[null,null,null,null,null,null,null,null,null,null,null,null,null,null,null,null,null,null,null,null,null,null,{"$f":"B21","v":1},null,{"$f":"D21","v":2},null,{"$f":"E21","v":2},null,null,null,{"$f":"AA22/AD21","v":2},""]
[10,{"$f":"INT(($U$1-1)*RAND()+2)","v":1},{"$f":"INT(($U$1-1)*RAND()+3)","v":2},{"$f":"IF(C23=B23,C23+1,C23)","v":2},{"$f":"B23*D23","v":2},{"$f":"E23-C23*D23","v":-2},{"$f":"IF($F23=$B23,$F23-1,$F23)","v":-2},{"$f":"IF(B23=2,1,INT((B23)*0.7*RAND()+1))","v":1},{"$f":"H23*D23","v":2},{"$f":"E23-I23","v":0},{"$f":"J23/B23","v":0},{"$f":"IF(K23<1,H23-1,H23)","v":0},{"$f":"L23*D23","v":0},{"$f":"E23-M23","v":2},{"$f":"N23/B23","v":2},{"$f":"INT($O23)","v":2},{"$f":"INT(0.99*P23*RAND()+1)","v":1},{"$f":"Q23*B23","v":1},{"$f":"IF(R23>=N23,Q23-1,Q23)","v":1},{"$f":"S23*B23","v":1},1,"+",{"$f":"L23","v":0},{"$f":"V23","v":"+"},{"$f":"S23","v":1},"=",{"$f":"M23+T23","v":1},{"$f":"IF(AA23>=AA24,\"Bad\",\"Good\")","v":"Good"},null,{"$f":"GCD(AA23,AA24)","v":1},{"$f":"AA23/AD23","v":1},""]
[null,null,null,null,null,null,null,null,null,null,null,null,null,null,null,null,null,null,null,null,null,null,{"$f":"B23","v":1},null,{"$f":"D23","v":2},null,{"$f":"E23","v":2},null,null,null,{"$f":"AA24/AD23","v":2},""]
[11,{"$f":"INT(($U$1-1)*RAND()+2)","v":1},{"$f":"INT(($U$1-1)*RAND()+3)","v":2},{"$f":"IF(C25=B25,C25+1,C25)","v":2},{"$f":"B25*D25","v":2},{"$f":"E25-C25*D25","v":-2},{"$f":"IF($F25=$B25,$F25-1,$F25)","v":-2},{"$f":"IF(B25=2,1,INT((B25)*0.7*RAND()+1))","v":1},{"$f":"H25*D25","v":2},{"$f":"E25-I25","v":0},{"$f":"J25/B25","v":0},{"$f":"IF(K25<1,H25-1,H25)","v":0},{"$f":"L25*D25","v":0},{"$f":"E25-M25","v":2},{"$f":"N25/B25","v":2},{"$f":"INT($O25)","v":2},{"$f":"INT(0.99*P25*RAND()+1)","v":1},{"$f":"Q25*B25","v":1},{"$f":"IF(R25>=N25,Q25-1,Q25)","v":1},{"$f":"S25*B25","v":1},1,"+",{"$f":"L25","v":0},{"$f":"V25","v":"+"},{"$f":"S25","v":1},"=",{"$f":"M25+T25","v":1},{"$f":"IF(AA25>=AA26,\"Bad\",\"Good\")","v":"Good"},null,{"$f":"GCD(AA25,AA26)","v":1},{"$f":"AA25/AD25","v":1},""]
[null,null,null,null,null,null,null,null,null,null,null,null,null,null,null,null,null,null,null,null,null,null,{"$f":"B25","v":1},null,{"$f":"D25","v":2},null,{"$f":"E25","v":2},null,null,null,{"$f":"AA26/AD25","v":2},""]
[12,{"$f":"INT(($U$1-1)*RAND()+2)","v":1},{"$f":"INT(($U$1-1)*RAND()+3)","v":2},{"$f":"IF(C27=B27,C27+1,C27)","v":2},{"$f":"B27*D27","v":2},{"$f":"E27-C27*D27","v":-2},{"$f":"IF($F27=$B27,$F27-1,$F27)","v":-2},{"$f":"IF(B27=2,1,INT((B27)*0.7*RAND()+1))","v":1},{"$f":"H27*D27","v":2},{"$f":"E27-I27","v":0},{"$f":"J27/B27","v":0},{"$f":"IF(K27<1,H27-1,H27)","v":0},{"$f":"L27*D27","v":0},{"$f":"E27-M27","v":2},{"$f":"N27/B27","v":2},{"$f":"INT($O27)","v":2},{"$f":"INT(0.99*P27*RAND()+1)","v":1},{"$f":"Q27*B27","v":1},{"$f":"IF(R27>=N27,Q27-1,Q27)","v":1},{"$f":"S27*B27","v":1},0,"+",{"$f":"L27","v":0},{"$f":"V27","v":"+"},{"$f":"S27","v":1},"=",{"$f":"M27+T27","v":1},{"$f":"IF(AA27>=AA28,\"Bad\",\"Good\")","v":"Good"},null,{"$f":"GCD(AA27,AA28)","v":1},{"$f":"AA27/AD27","v":1},""]
[null,null,null,null,null,null,null,null,null,null,null,null,null,null,null,null,null,null,null,null,null,null,{"$f":"B27","v":1},null,{"$f":"D27","v":2},null,{"$f":"E27","v":2},null,null,null,{"$f":"AA28/AD27","v":2},""]
[13,{"$f":"INT(($U$1-1)*RAND()+2)","v":1},{"$f":"INT(($U$1-1)*RAND()+3)","v":2},{"$f":"IF(C29=B29,C29+1,C29)","v":2},{"$f":"B29*D29","v":2},{"$f":"E29-C29*D29","v":-2},{"$f":"IF($F29=$B29,$F29-1,$F29)","v":-2},{"$f":"IF(B29=2,1,INT((B29)*0.7*RAND()+1))","v":1},{"$f":"H29*D29","v":2},{"$f":"E29-I29","v":0},{"$f":"J29/B29","v":0},{"$f":"IF(K29<1,H29-1,H29)","v":0},{"$f":"L29*D29","v":0},{"$f":"E29-M29","v":2},{"$f":"N29/B29","v":2},{"$f":"INT($O29)","v":2},{"$f":"INT(0.99*P29*RAND()+1)","v":2},{"$f":"Q29*B29","v":2},{"$f":"IF(R29>=N29,Q29-1,Q29)","v":1},{"$f":"S29*B29","v":1},0,"+",{"$f":"L29","v":0},{"$f":"V29","v":"+"},{"$f":"S29","v":1},"=",{"$f":"M29+T29","v":1},{"$f":"IF(AA29>=AA30,\"Bad\",\"Good\")","v":"Good"},null,{"$f":"GCD(AA29,AA30)","v":1},{"$f":"AA29/AD29","v":1},""]
[null,null,null,null,null,null,null,null,null,null,null,null,null,null,null,null,null,null,null,null,null,null,{"$f":"B29","v":1},null,{"$f":"D29","v":2},null,{"$f":"E29","v":2},null,null,null,{"$f":"AA30/AD29","v":2},""]
[14,{"$f":"INT(($U$1-1)*RAND()+2)","v":1},{"$f":"INT(($U$1-1)*RAND()+3)","v":2},{"$f":"IF(C31=B31,C31+1,C31)","v":2},{"$f":"B31*D31","v":2},{"$f":"E31-C31*D31","v":-2},{"$f":"IF($F31=$B31,$F31-1,$F31)","v":-2},{"$f":"IF(B31=2,1,INT((B31)*0.7*RAND()+1))","v":1},{"$f":"H31*D31","v":2},{"$f":"E31-I31","v":0},{"$f":"J31/B31","v":0},{"$f":"IF(K31<1,H31-1,H31)","v":0},{"$f":"L31*D31","v":0},{"$f":"E31-M31","v":2},{"$f":"N31/B31","v":2},{"$f":"INT($O31)","v":2},{"$f":"INT(0.99*P31*RAND()+1)","v":1},{"$f":"Q31*B31","v":1},{"$f":"IF(R31>=N31,Q31-1,Q31)","v":1},{"$f":"S31*B31","v":1},0,"+",{"$f":"L31","v":0},{"$f":"V31","v":"+"},{"$f":"S31","v":1},"=",{"$f":"M31+T31","v":1},{"$f":"IF(AA31>=AA32,\"Bad\",\"Good\")","v":"Good"},null,{"$f":"GCD(AA31,AA32)","v":1},{"$f":"AA31/AD31","v":1},""]
[null,null,null,null,null,null,null,null,null,null,null,null,null,null,null,null,null,null,null,null,null,null,{"$f":"B31","v":1},null,{"$f":"D31","v":2},null,{"$f":"E31","v":2},null,null,null,{"$f":"AA32/AD31","v":2},""]
[15,{"$f":"INT(($U$1-1)*RAND()+2)","v":1},{"$f":"INT(($U$1-1)*RAND()+3)","v":2},{"$f":"IF(C33=B33,C33+1,C33)","v":2},{"$f":"B33*D33","v":2},{"$f":"E33-C33*D33","v":-2},{"$f":"IF($F33=$B33,$F33-1,$F33)","v":-2},{"$f":"IF(B33=2,1,INT((B33)*0.7*RAND()+1))","v":1},{"$f":"H33*D33","v":2},{"$f":"E33-I33","v":0},{"$f":"J33/B33","v":0},{"$f":"IF(K33<1,H33-1,H33)","v":0},{"$f":"L33*D33","v":0},{"$f":"E33-M33","v":2},{"$f":"N33/B33","v":2},{"$f":"INT($O33)","v":2},{"$f":"INT(0.99*P33*RAND()+1)","v":2},{"$f":"Q33*B33","v":2},{"$f":"IF(R33>=N33,Q33-1,Q33)","v":1},{"$f":"S33*B33","v":1},0,"+",{"$f":"L33","v":0},{"$f":"V33","v":"+"},{"$f":"S33","v":1},"=",{"$f":"M33+T33","v":1},{"$f":"IF(AA33>=AA34,\"Bad\",\"Good\")","v":"Good"},null,{"$f":"GCD(AA33,AA34)","v":1},{"$f":"AA33/AD33","v":1},""]
[null,null,null,null,null,null,null,null,null,null,null,null,null,null,null,null,null,null,null,null,null,null,{"$f":"B33","v":1},null,{"$f":"D33","v":2},null,{"$f":"E33","v":2},null,null,null,{"$f":"AA34/AD33","v":2},""]
[16,{"$f":"INT(($U$1-1)*RAND()+2)","v":1},{"$f":"INT(($U$1-1)*RAND()+3)","v":2},{"$f":"IF(C35=B35,C35+1,C35)","v":2},{"$f":"B35*D35","v":2},{"$f":"E35-C35*D35","v":-2},{"$f":"IF($F35=$B35,$F35-1,$F35)","v":-2},{"$f":"IF(B35=2,1,INT((B35)*0.7*RAND()+1))","v":1},{"$f":"H35*D35","v":2},{"$f":"E35-I35","v":0},{"$f":"J35/B35","v":0},{"$f":"IF(K35<1,H35-1,H35)","v":0},{"$f":"L35*D35","v":0},{"$f":"E35-M35","v":2},{"$f":"N35/B35","v":2},{"$f":"INT($O35)","v":2},{"$f":"INT(0.99*P35*RAND()+1)","v":1},{"$f":"Q35*B35","v":1},{"$f":"IF(R35>=N35,Q35-1,Q35)","v":1},{"$f":"S35*B35","v":1},0,"+",{"$f":"L35","v":0},{"$f":"V35","v":"+"},{"$f":"S35","v":1},"=",{"$f":"M35+T35","v":1},{"$f":"IF(AA35>=AA36,\"Bad\",\"Good\")","v":"Good"},null,{"$f":"GCD(AA35,AA36)","v":1},{"$f":"AA35/AD35","v":1},""]
[null,null,null,null,null,null,null,null,null,null,null,null,null,null,null,null,null,null,null,null,null,null,{"$f":"B35","v":1},null,{"$f":"D35","v":2},null,{"$f":"E35","v":2},null,null,null,{"$f":"AA36/AD35","v":2},""]
[17,{"$f":"INT(($U$1-1)*RAND()+2)","v":1},{"$f":"INT(($U$1-1)*RAND()+3)","v":2},{"$f":"IF(C37=B37,C37+1,C37)","v":2},{"$f":"B37*D37","v":2},{"$f":"E37-C37*D37","v":-2},{"$f":"IF($F37=$B37,$F37-1,$F37)","v":-2},{"$f":"IF(B37=2,1,INT((B37)*0.7*RAND()+1))","v":1},{"$f":"H37*D37","v":2},{"$f":"E37-I37","v":0},{"$f":"J37/B37","v":0},{"$f":"IF(K37<1,H37-1,H37)","v":0},{"$f":"L37*D37","v":0},{"$f":"E37-M37","v":2},{"$f":"N37/B37","v":2},{"$f":"INT($O37)","v":2},{"$f":"INT(0.99*P37*RAND()+1)","v":1},{"$f":"Q37*B37","v":1},{"$f":"IF(R37>=N37,Q37-1,Q37)","v":1},{"$f":"S37*B37","v":1},1,"+",{"$f":"L37","v":0},{"$f":"V37","v":"+"},{"$f":"S37","v":1},"=",{"$f":"M37+T37","v":1},{"$f":"IF(AA37>=AA38,\"Bad\",\"Good\")","v":"Good"},null,{"$f":"GCD(AA37,AA38)","v":1},{"$f":"AA37/AD37","v":1},""]
[null,null,null,null,null,null,null,null,null,null,null,null,null,null,null,null,null,null,null,null,null,null,{"$f":"B37","v":1},null,{"$f":"D37","v":2},null,{"$f":"E37","v":2},null,null,null,{"$f":"AA38/AD37","v":2},""]
[18,{"$f":"INT(($U$1-1)*RAND()+2)","v":1},{"$f":"INT(($U$1-1)*RAND()+3)","v":2},{"$f":"IF(C39=B39,C39+1,C39)","v":2},{"$f":"B39*D39","v":2},{"$f":"E39-C39*D39","v":-2},{"$f":"IF($F39=$B39,$F39-1,$F39)","v":-2},{"$f":"IF(B39=2,1,INT((B39)*0.7*RAND()+1))","v":1},{"$f":"H39*D39","v":2},{"$f":"E39-I39","v":0},{"$f":"J39/B39","v":0},{"$f":"IF(K39<1,H39-1,H39)","v":0},{"$f":"L39*D39","v":0},{"$f":"E39-M39","v":2},{"$f":"N39/B39","v":2},{"$f":"INT($O39)","v":2},{"$f":"INT(0.99*P39*RAND()+1)","v":2},{"$f":"Q39*B39","v":2},{"$f":"IF(R39>=N39,Q39-1,Q39)","v":1},{"$f":"S39*B39","v":1},1,"+",{"$f":"L39","v":0},{"$f":"V39","v":"+"},{"$f":"S39","v":1},"=",{"$f":"M39+T39","v":1},{"$f":"IF(AA39>=AA40,\"Bad\",\"Good\")","v":"Good"},null,{"$f":"GCD(AA39,AA40)","v":1},{"$f":"AA39/AD39","v":1},""]
[null,null,null,null,null,null,null,null,null,null,null,null,null,null,null,null,null,null,null,null,null,null,{"$f":"B39","v":1},null,{"$f":"D39","v":2},null,{"$f":"E39","v":2},null,null,null,{"$f":"AA40/AD39","v":2},""]
[19,{"$f":"INT(($U$1-1)*RAND()+2)","v":1},{"$f":"INT(($U$1-1)*RAND()+3)","v":2},{"$f":"IF(C41=B41,C41+1,C41)","v":2},{"$f":"B41*D41","v":2},{"$f":"E41-C41*D41","v":-2},{"$f":"IF($F41=$B41,$F41-1,$F41)","v":-2},{"$f":"IF(B41=2,1,INT((B41)*0.7*RAND()+1))","v":1},{"$f":"H41*D41","v":2},{"$f":"E41-I41","v":0},{"$f":"J41/B41","v":0},{"$f":"IF(K41<1,H41-1,H41)","v":0},{"$f":"L41*D41","v":0},{"$f":"E41-M41","v":2},{"$f":"N41/B41","v":2},{"$f":"INT($O41)","v":2},{"$f":"INT(0.99*P41*RAND()+1)","v":1},{"$f":"Q41*B41","v":1},{"$f":"IF(R41>=N41,Q41-1,Q41)","v":1},{"$f":"S41*B41","v":1},1,"+",{"$f":"L41","v":0},{"$f":"V41","v":"+"},{"$f":"S41","v":1},"=",{"$f":"M41+T41","v":1},{"$f":"IF(AA41>=AA42,\"Bad\",\"Good\")","v":"Good"},null,{"$f":"GCD(AA41,AA42)","v":1},{"$f":"AA41/AD41","v":1},""]
[null,null,null,null,null,null,null,null,null,null,null,null,null,null,null,null,null,null,null,null,null,null,{"$f":"B41","v":1},null,{"$f":"D41","v":2},null,{"$f":"E41","v":2},null,null,null,{"$f":"AA42/AD41","v":2},""]
[20,{"$f":"INT(($U$1-1)*RAND()+2)","v":1},{"$f":"INT(($U$1-1)*RAND()+3)","v":2},{"$f":"IF(C43=B43,C43+1,C43)","v":2},{"$f":"B43*D43","v":2},{"$f":"E43-C43*D43","v":-2},{"$f":"IF($F43=$B43,$F43-1,$F43)","v":-2},{"$f":"IF(B43=2,1,INT((B43)*0.7*RAND()+1))","v":1},{"$f":"H43*D43","v":2},{"$f":"E43-I43","v":0},{"$f":"J43/B43","v":0},{"$f":"IF(K43<1,H43-1,H43)","v":0},{"$f":"L43*D43","v":0},{"$f":"E43-M43","v":2},{"$f":"N43/B43","v":2},{"$f":"INT($O43)","v":2},{"$f":"INT(0.99*P43*RAND()+1)","v":2},{"$f":"Q43*B43","v":2},{"$f":"IF(R43>=N43,Q43-1,Q43)","v":1},{"$f":"S43*B43","v":1},0,"+",{"$f":"L43","v":0},{"$f":"V43","v":"+"},{"$f":"S43","v":1},"=",{"$f":"M43+T43","v":1},{"$f":"IF(AA43>=AA44,\"Bad\",\"Good\")","v":"Good"},null,{"$f":"GCD(AA43,AA44)","v":1},{"$f":"AA43/AD43","v":1},""]
[null,null,null,null,null,null,null,null,null,null,null,null,null,null,null,null,null,null,null,null,null,null,{"$f":"B43","v":1},null,{"$f":"D43","v":2},null,{"$f":"E43","v":2},null,null,null,{"$f":"AA44/AD43","v":2},""]